{"text_format":"1","workbook":"xlsx","n_sheets":14,"sheets":["Home","Contact","MEGA","HDO","DIGITAL","THRESHOLD","COMS","LISTS","MEGA Review","HDO Review","DIGITAL Review","Threshold Review","Contact Review","UPC Review"],"not_rendered":{"charts":0,"images":0,"macros":1,"external_links":0,"defined_names":16,"comments":0,"pivot_tables":0},"unopened":[],"bounds":{"document_bytes":16777216,"sheet_cells":100000,"rows_first":2000,"rows_last":500,"rows_between":2000,"halvings":0,"cell_chars":16384,"cell_head_chars":4096},"cells_cut":0,"cells_raw":0,"read":"whole","date_system":"1900"}

{"sheet":"Home","index":0,"n_rows":30,"n_cols":15,"rows_kept":30,"cut":false,"hidden":false,"merged":[[16,6,25,11],[0,32,2,34],[0,0,2,7],[0,8,2,15],[0,16,2,23],[0,24,2,31]]}
["  maps"]
[]
[]
["MAPS Event Participation Form V13"]
["Instructions"]
["Click Enable Macros after opening the workbook to access the forms features"]
["Do not open this speadsheet from an email.  Save it to a location on your computer and launch from there."]
["All information should be verified by the supplier prior to submission. It is CRUCIAL that the information you provide is accurate and up to date. "]
["Use the forms \"Next\" and \"Back\" buttons to navigate the form"]
["Only one event type can be submitted at a time. If you have multiple event types to submit for, please complete all submission for one event type and then start the next event type with a clean copy of the MAPS Event Participation Form V2."]
[]
[]
[]
[null,null,null,null,"Event Type:",null,null,null,null,null,null,null,null,null,1]
[]
[]
[null,null,null,null,"Event Description:"]
[]
[]
[]
[]
[]
[]
[]
[]
[]
[]
[]
[]
[null,null,null,null,null,null,null,null,"Next"]

{"sheet":"Contact","index":1,"n_rows":33,"n_cols":8,"rows_kept":33,"cut":false,"hidden":false,"merged":[[12,7,12,15],[13,7,13,15],[14,7,14,15],[15,7,15,15],[16,7,16,15],[17,7,17,15],[0,0,2,4],[3,0,4,3],[9,7,9,15],[10,7,10,15],[11,7,11,15],[29,0,29,3],[29,7,29,15],[30,0,30,3],[30,7,30,15],[31,0,31,3],[31,7,31,15],[18,7,18,15],[23,7,23,15],[24,7,24,15],[25,7,25,15],[28,0,28,3],[28,7,28,15],[19,7,19,15],[20,7,20,15],[21,7,21,15],[22,7,22,15],[26,7,26,15],[27,7,27,15],[35,7,35,15],[36,7,36,15],[37,7,37,15],[38,7,38,15],[39,7,39,15],[40,7,40,15],[32,0,32,3],[32,7,32,15],[33,0,33,3],[33,7,33,15],[34,0,34,3],[34,7,34,15],[47,7,47,15],[48,7,48,15],[49,7,49,15],[50,7,50,15],[51,7,51,15],[52,7,52,15],[41,7,41,15],[42,7,42,15],[43,7,43,15],[44,7,44,15],[45,7,45,15],[46,7,46,15],[59,7,59,15],[60,7,60,15],[61,7,61,15],[62,7,62,15],[63,7,63,15],[64,7,64,15],[53,7,53,15],[54,7,54,15],[55,7,55,15],[56,7,56,15],[57,7,57,15],[58,7,58,15],[71,7,71,15],[72,7,72,15],[73,7,73,15],[74,7,74,15],[75,7,75,15],[76,7,76,15],[65,7,65,15],[66,7,66,15],[67,7,67,15],[68,7,68,15],[69,7,69,15],[70,7,70,15],[83,7,83,15],[84,7,84,15],[85,7,85,15],[86,7,86,15],[87,7,87,15],[88,7,88,15],[77,7,77,15],[78,7,78,15],[79,7,79,15],[80,7,80,15],[81,7,81,15],[82,7,82,15],[95,7,95,15],[96,7,96,15],[97,7,97,15],[98,7,98,15],[99,7,99,15],[100,7,100,15],[89,7,89,15],[90,7,90,15],[91,7,91,15],[92,7,92,15],[93,7,93,15],[94,7,94,15],[107,7,107,15],[108,7,108,15],[109,7,109,15],[110,7,110,15],[111,7,111,15],[112,7,112,15],[101,7,101,15],[102,7,102,15],[103,7,103,15],[104,7,104,15],[105,7,105,15],[106,7,106,15],[119,7,119,15],[120,7,120,15],[121,7,121,15],[122,7,122,15],[123,7,123,15],[124,7,124,15],[113,7,113,15],[114,7,114,15],[115,7,115,15],[116,7,116,15],[117,7,117,15],[118,7,118,15],[131,7,131,15],[132,7,132,15],[133,7,133,15],[134,7,134,15],[135,7,135,15],[136,7,136,15],[125,7,125,15],[126,7,126,15],[127,7,127,15],[128,7,128,15],[129,7,129,15],[130,7,130,15],[143,7,143,15],[144,7,144,15],[145,7,145,15],[146,7,146,15],[147,7,147,15],[148,7,148,15],[137,7,137,15],[138,7,138,15],[139,7,139,15],[140,7,140,15],[141,7,141,15],[142,7,142,15],[155,7,155,15],[156,7,156,15],[157,7,157,15],[158,7,158,15],[159,7,159,15],[160,7,160,15],[149,7,149,15],[150,7,150,15],[151,7,151,15],[152,7,152,15],[153,7,153,15],[154,7,154,15],[167,7,167,15],[168,7,168,15],[169,7,169,15],[170,7,170,15],[171,7,171,15],[172,7,172,15],[161,7,161,15],[162,7,162,15],[163,7,163,15],[164,7,164,15],[165,7,165,15],[166,7,166,15],[179,7,179,15],[180,7,180,15],[181,7,181,15],[182,7,182,15],[183,7,183,15],[184,7,184,15],[173,7,173,15],[174,7,174,15],[175,7,175,15],[176,7,176,15],[177,7,177,15],[178,7,178,15],[191,7,191,15],[192,7,192,15],[193,7,193,15],[194,7,194,15],[195,7,195,15],[196,7,196,15],[185,7,185,15],[186,7,186,15],[187,7,187,15],[188,7,188,15],[189,7,189,15],[190,7,190,15],[203,7,203,15],[204,7,204,15],[205,7,205,15],[206,7,206,15],[207,7,207,15],[208,7,208,15],[197,7,197,15],[198,7,198,15],[199,7,199,15],[200,7,200,15],[201,7,201,15],[202,7,202,15],[216,7,216,15],[217,7,217,15],[218,7,218,15],[219,7,219,15],[220,7,220,15],[209,7,209,15],[210,7,210,15],[211,7,211,15],[212,7,212,15],[213,7,213,15],[214,7,214,15],[239,7,239,15],[240,7,240,15],[241,7,241,15],[242,7,242,15],[5,0,8,9],[233,7,233,15],[234,7,234,15],[235,7,235,15],[236,7,236,15],[237,7,237,15],[238,7,238,15],[227,7,227,15],[228,7,228,15],[229,7,229,15],[230,7,230,15],[231,7,231,15],[232,7,232,15],[221,7,221,15],[222,7,222,15],[223,7,223,15],[224,7,224,15],[225,7,225,15],[226,7,226,15],[215,7,215,15]]}
["  maps"]
[]
[]
["Contact Information"]
[]
["Please complete your contact information using the fields below. You can add as many contacts as you like by using the Add Contact button below. All contacts listed will receive any communication generated by MAPS for this submission. For digital coupon submissions, contact information will be passed along to Inmar for coupon reporting. If the contact you are entering is the appropriate contact for billing matters, please check Yes for Billing Contact. You must add at least one contact before proceeding."]
[]
[]
[]
[null,null,null,null,null,null,null,"Contact(s)"]
[null,"First Name",null,null,null,null,"Remove"]
[]
[null,"Last Name "]
[]
[null,"E-mail Address"]
[]
[null,"K#"]
[]
[null,"Company"]
[]
[null,"Address"]
[]
[null,"City, State"]
[]
[null,"Phone Number"]
[]
[null,"Billing Contact"]
[]
[null,null,null,null,"Add Contact"]
[]
[null,null,null,null,"Continue"]
[]
[null,null,null,null,"Back"]

{"sheet":"MEGA","index":2,"n_rows":31,"n_cols":6,"rows_kept":31,"cut":false,"hidden":false,"merged":[[0,0,2,4],[3,0,4,6],[24,1,27,1],[5,0,7,15]]}
["  maps"]
[]
[]
["MEGA/Department Threshold Events"]
[]
["MEGA/Department Threshold Events (i.e. Buy 5 or More, Save $1 Each) and Department Threshold Events (i.e. Spend $40, Save $10 Baby Event) are large scale promotions executed across the enterprise.  For MEGA events, vendors are responsible for paying the net down redemption, $0.08 RASC handling fee per transaction – fair share distributed based on unit redemptions, and a percentage of POS expenses based on unit redemptions.  For Department Threshold Events such as Spend $X, Save $X events, vendors will be charged a fair share amount of total event redemptions and marketing materials cost based on their total sales on participating items."]
[]
[]
[null,null,"View All Groups"]
[null,null,"Return to Billing Information"]
[null,null,"Save Group"]
[null,"Event Period (Start)"]
[]
[null,"Event Week (Start)"]
[]
[null,"Event Year (Start)"]
[]
[null,"Group Description"]
[]
[null,"Department"]
[]
[null,"Commodity"]
[]
[null,"Division Eligibility:",null,null,null,"Select All"]
[null,"Only uncheck a division if the items WILL NOT participate in that division.\n",null,null,null,"Fred Meyer Only"]
[null,null,null,null,null,"All Except F4L & Roundy's"]
[null,null,null,null,null,"Remove All"]
[]
[]
[null,"Format as 13-digit UPC","UPC INFORMATION"]
[null,"Consumer UPC (13-digit)\n NO CASE UPCS, NO CHECK DIGITS, NO HYPHENS, NO SPACES","Product Description","UPC Size"]

{"sheet":"HDO","index":3,"n_rows":41,"n_cols":36,"rows_kept":41,"cut":false,"hidden":false,"merged":[[37,3,37,5],[0,0,2,4],[5,0,8,15],[30,1,33,1],[3,0,4,3],[9,9,11,11],[19,4,25,8],[12,4,13,8],[11,4,11,8],[15,4,16,8],[37,1,37,2]]}
["  maps",null,null,null,null,null,null,null,null,null,null,null,null,null,null,null,null,null,null,null,null,null,null,null,null,null,null,null,null,null,null,null,null,null,null,"HDO"]
[]
[]
["Weekly Digital Deals"]
[]
["Weekly Digital Deals – a fixed retail coupon available for a limited time to customers at an extremely hot net down retail.  This offer is planned by the merchandising teams in coordination with promo planning teams.  Vendors are responsible for paying the full coupon redemption, $0.08 per download/clip INMAR/You-Tech fee, $0.08 per redemption RASC handling fee, and POS expenses.  WDDs have unlimited downloads and are redeemable for each customer a multiple of times defined by the program (3X, 5X, etc.)."]
[]
[]
[]
[null,null,"View All Coupons"]
[null,null,"Return to Billing Information"]
[null,null,"Save Coupon",null,"Coupon Verbiage"]
[null,null,null,null,{"$f":"IFERROR(DOLLAR(C22),C22) & \" \" & C24 & CHAR(10) & \"When you buy ONE (1) \" & C24&\", \" &C26","v":"$0.00 \nWhen you buy ONE (1) , "}]
[null,"Event Week"]
[]
[null,"Department",null,null,"The above is designed to accurately format 99% of coupons. If your coupon is an outlier, please simply include preferred verbiage in your comment below."]
[]
[null,"Commodity"]
[null,null,null,null,"Comment","(If PO is required for invoice, please supply here.)"]
[null,"Brand"]
[]
[null,"Net Down Retail"]
[]
[null,"Item Description"]
[]
[null,"Size Range"]
[]
[null,"Funding"]
[]
[null,"Division Eligibility",null,null,null,"Select All"]
[null,"Only uncheck a division if the items WILL NOT participate in that division.\n",null,null,null,"Fred Meyer Only"]
[null,null,null,null,null,"All Except F4L & Roundy's"]
[null,null,null,null,null,"Remove All"]
[]
[]
[null,"Expand UPCs to RBP Group"]
[]
[null,"Image upload disabled, Please see CM for any image upload requests"]
[]
[null,"Format as 13-digit UPC","UPC INFORMATION"]
{"$rows_left_out":2}
{"sheet":"DIGITAL","index":4,"n_rows":42,"n_cols":6,"rows_kept":42,"cut":false,"hidden":false,"merged":[[38,3,38,5],[15,4,16,8],[19,4,27,8],[31,1,34,1],[0,0,2,4],[3,0,4,3],[5,0,8,15],[9,9,11,11],[11,4,11,8],[12,4,13,8],[38,1,38,2]]}
["  maps"]
[]
[]
["Digital 5X Event"]
[]
["Digital 5X Event – a multi-week digital coupon event across a variety of suppliers allowing customers to redeem up to 5 times per transaction.  Vendors are responsible for paying the full coupon redemption, $0.08 per download/clip INMAR/You-Tech fee, $0.08 per redemption RASC handling fee, and POS expenses.  5X events have unlimited downloads and participating coupon items should have widespread distribution in planned divisions."]
[]
[]
[]
[null,null,"View All Coupons"]
[null,null,"Return to Billing Information"]
[null,null,"Save Coupon",null,"Coupon Verbiage"]
[null,null,null,null,{"$f":"\"Save \" & IFERROR(DOLLAR(C22),C22) & IF(C24=1, \" on \", \" off \" & C24 & \" \") &C26 & CHAR(10) & \"When you buy \"& VLOOKUP(C24,LISTS!$G:$H,2,FALSE) & \" (\" & C24 &\") \" & C26 & \", \" & C28","v":{"$error":"#N/A"}}]
[null,"Event Week"]
[]
[null,"Department",null,null,"The above is designed to accurately format 99% of coupons. If your coupon is an outlier, please simply include preferred verbiage in your comment below."]
[]
[null,"Commodity"]
[null,null,null,null,"Comment","(If PO is required for invoice, please supply here.)"]
[null,"Brand"]
[]
[null,"Coupon Value"]
[]
[null,"Requirement Quantity"]
[]
[null,"Item Description"]
[]
[null,"Size Range"]
[]
[]
[null,"Division Eligibility",null,null,null,"Select All"]
[null,"Only uncheck a division if the items WILL NOT participate in that division.\n",null,null,null,"Fred Meyer Only"]
[null,null,null,null,null,"All Except F4L & Roundy's"]
[null,null,null,null,null,"Remove All"]
[]
[]
[null,"Expand UPCs to RBP Group"]
[]
[null,"Image upload disabled, Please see CM for any image upload requests"]
[]
{"$rows_left_out":3}
{"sheet":"THRESHOLD","index":5,"n_rows":43,"n_cols":8,"rows_kept":43,"cut":false,"hidden":false,"merged":[[35,1,38,1],[21,2,23,2],[0,0,2,6],[3,0,4,3],[5,0,8,17],[9,11,11,13],[11,6,11,10],[12,6,13,10],[20,10,21,10],[14,6,19,10],[20,6,21,6],[20,7,21,7],[20,8,21,8],[20,9,21,9]]}
["  maps"]
[]
[]
["Small Scale Threshold Event & Must Buys"]
[]
["Small Scale Threshold Event & Must Buys – a complex retail promotion affecting a small group of related items or a singular vendor’s items.  Examples of complex retail promotions include “$4.99 Must Buy 2”, “Buy X Product, Get Y Product Free”, “Buy One, Get One 50% Off”.  Vendors are responsible for paying the net down redemption expense, $0.08 RASC handling fee for each redeeming instance of the loyalty offer, and POS expenses."]
[]
[]
[]
[null,null,"View All Events"]
[null,null,"Return to Billing Information"]
[null,null,"Save Event"]
[null,null,null,null,null,null,"Additional Comments"]
[null,"Event Start"]
[]
[null,"Event End"]
[]
[null,"Department"]
[]
[null,"Commodity"]
[]
[null,"Offer Description"]
[]
[]
[]
[null,"Offer Limit"]
[]
[null,"Billing Type"]
[]
[null,"Tags Requested"]
[]
[null,"Signs Requested"]
[]
[]
[null,"Division Eligibility",null,null,null,null,null,"Select All"]
[null,"Only uncheck a division if the items WILL NOT participate in that division.\n",null,null,null,null,null,"Fred Meyer Only"]
[null,null,null,null,null,null,null,"All Except F4L & Roundy's"]
[null,null,null,null,null,null,null,"Remove All"]
[null,null,""]
[]
{"$rows_left_out":4}
{"sheet":"COMS","index":6,"n_rows":780,"n_cols":2,"rows_kept":780,"cut":false,"hidden":false,"merged":[]}
["Dept2","Commodity"]
["01 - Grocery","001 - CANNED FRUIT/FRUIT BOWLS                                         "]
["01 - Grocery","002 - CAN VEGETABLES - SHELF STABLE                                    "]
["01 - Grocery","003 - CAN BEANS                                                        "]
["01 - Grocery","004 - MEAT - SHELF STABLE                                              "]
["01 - Grocery","005 - CAN SEAFOOD - SHELF STABLE                                       "]
["01 - Grocery","006 - CANNED SOUPS                                                     "]
["01 - Grocery","007 - SHELF STABLE JUICE                                               "]
["01 - Grocery","008 - CANNED & DRY MILK                                                "]
["01 - Grocery","010 - ISOTONIC DRINKS                                                  "]
["01 - Grocery","011 - RTD TEA/LEMONADE                                                 "]
["01 - Grocery","012 - MIXERS                                                           "]
["01 - Grocery","013 - SPICES & EXTRACTS                                                "]
["01 - Grocery","014 - MOLASSES/SYRUPS/PANCAKE MIXES                                    "]
["01 - Grocery","015 - SUGARS & SWEETENERS                                              "]
["01 - Grocery","016 - BAKING NEEDS                                                     "]
["01 - Grocery","017 - FLOUR & MEALS                                                    "]
["01 - Grocery","018 - BAKING MIXES                                                     "]
["01 - Grocery","019 - SHORTENING & OIL                                                 "]
["01 - Grocery","022 - TOMATO PRODUCTS-SHELF STABLE                                     "]
["01 - Grocery","023 - CANNED PASTA&MWV FD-SHLF STBL                                    "]
["01 - Grocery","024 - COFFEE & CREAMERS                                                "]
["01 - Grocery","025 - TEAS                                                             "]
["01 - Grocery","026 - DRY RAMEN                                                        "]
["01 - Grocery","027 - BEVERAGE ENHANCERS                                               "]
["01 - Grocery","028 - COCOA MIXES                                                      "]
["01 - Grocery","029 - SOFT DRINKS                                                      "]
["01 - Grocery","030 - OLIVE OIL                                                        "]
["01 - Grocery","032 - SPECIALTY SOFT DRINKS                                            "]
["01 - Grocery","033 - FRUIT SNACKS                                                     "]
["01 - Grocery","034 - LIQUOR                                                           "]
["01 - Grocery","035 - WATER                                                            "]
["01 - Grocery","036 - FROZEN DESSERTS                                                  "]
["01 - Grocery","037 - FROZEN HANDHELDS & SNACKS                                        "]
["01 - Grocery","038 - FROZEN PIZZA                                                     "]
["01 - Grocery","039 - FRZN SS PREMIUM MEALS                                            "]
["01 - Grocery","040 - FROZEN VEGETABLE & VEG DISH                                      "]
["01 - Grocery","041 - FROZEN POTATOES                                                  "]
["01 - Grocery","042 - FROZEN FRUITS                                                    "]
["01 - Grocery","043 - FROZEN JUICE                                                     "]
{"$rows_left_out":741}
{"sheet":"LISTS","index":7,"n_rows":333,"n_cols":12,"rows_kept":333,"cut":false,"hidden":false,"merged":[]}
[null,null,null,"Ad Start","PW",null,null,null,null,null,1," "]
["MEGA Event/Department Threshold Event",null,null,"2022-09-21","P9W2 2022",null,1,"ONE",null,"No Limit",2,"MEGA/Department Threshold Events (i.e. Buy 5 or More, Save $1 Each) and Department Threshold Events (i.e. Spend $40, Save $10 Baby Event) are large scale promotions executed across the enterprise. For MEGA events, vendors are responsible for paying the net down redemption, $0.08 RASC handling fee, and a percentage of POS expenses based on unit redemptions. For Department Threshold Events such as Spend $X, Save $X events, vendors will be charged a fair share amount of total event redemptions and marketing materials cost based on their total sales on participating items."]
["Weekly Digital Deals",{"$f":"TODAY() -#REF!","v":{"$error":"#REF!"}},null,"2022-09-28","P9W3 2022",null,2,"TWO",null,"1 Reward",3,"Weekly Digital Deals - a fixed retail coupon available for a limited time to customers at an extremely hot net down retail. This offer is planned by the merchandising teams in coordination with promo planning teams. Vendors are responsible for paying the full coupon redemption, $0.08 per download Inmar fee, and an $0.08 per redemption RASC handling fee. WDDs have unlimited downloads and are redeemable for each customer a multiple of times defined by the program (3X, 5X, etc.)"]
["5X Digital Event",{"$f":"TODAY() -#REF!","v":{"$error":"#REF!"}},null,"2022-10-05","P9W4 2022",null,3,"THREE",null,"2 Rewards",4,"Digital 5X Event - a multi-week digital coupon event across a variety of suppliers allowing customers to redeem up to 5 times per transaction.  Vendors are responsible for paying the full coupon redemption, $0.08 per download Inmar fee, and an $0.08 per redemption RASC handling fee. 5X events have unilimited downloads and participating coupon items should have widespread distribution in planned divisions."]
["Small Scale Threshold Event & Must Buys",null,null,"2022-10-12","P10W1 2022",null,4,"FOUR",null,"3 Rewards",5,"Small Scale Threshold Event & Must Buys - a complex retail promotion affecting a small group of related items or a singular vendor's items. Examples of complex retail promotions include \"$4.99 Must Buy 2\", \"Buy X Product, Get Y Product Free\", \"Buy One, Get One 50% Off\".  Vendors are responsible for paying the net down redemption, $0.08 RASC handling fee, and POS expenses."]
[null,null,null,"2022-10-19","P10W2 2022",null,5,"FIVE",null,"4 Rewards"]
[null,null,null,"2022-10-26","P10W3 2022",null,6,"SIX",null,"5 Rewards"]
[null,null,null,"2022-11-02","P10W4 2022",null,7,"SEVEN",null,"6 Rewards"]
[null,null,null,"2022-11-09","P11W1 2022",null,8,"EIGHT",null,"7 Rewards","Vendor Funded"]
[null,null,null,"2022-11-16","P11W2 2022",null,9,"NINE",null,"8 Rewards","Department Funded"]
[null,null,null,"2022-11-23","P11W3 2022",null,10,"TEN",null,"9 Rewards"]
[null,null,null,"2022-11-30","P11W4 2022",null,11,"ELEVEN",null,"10 Rewards"]
[null,null,null,"2022-12-07","P12W1 2022",null,12,"TWELVE",null,"11 Rewards"]
[null,null,null,"2022-12-14","P12W2 2022",null,13,"THIRTEEN",null,"12 Rewards"]
[null,null,null,"2022-12-21","P12W3 2022",null,14,"FOURTEEN"]
[null,null,null,"2022-12-28","P12W4 2022",null,15,"FIFTEEN"]
[null,null,null,"2023-01-04","P13W1 2022",null,16,"SIXTEEN"]
[null,null,null,"2023-01-11","P13W2 2022",null,17,"SEVENTEEN"]
[null,null,null,"2023-01-18","P13W3 2022",null,18,"EIGHTEEN"]
[null,null,null,"2023-01-25","P13W4 2022",null,19,"NINETEEN"]
[null,null,null,"2023-02-01","P1W1 2023",null,20,"TWENTY"]
[null,null,null,"2023-02-08","P1W2 2023"]
[null,null,null,"2023-02-15","P1W3 2023"]
[null,null,null,"2023-02-22","P1W4 2023"]
[null,null,null,"2023-03-01","P2W1 2023"]
[null,null,null,"2023-03-08","P2W2 2023"]
[null,null,null,"2023-03-15","P2W3 2023"]
[null,null,null,"2023-03-22","P2W4 2023"]
[null,null,null,"2023-03-29","P3W1 2023"]
[null,null,null,"2023-04-05","P3W2 2023"]
[null,null,null,"2023-04-12","P3W3 2023"]
[null,null,null,"2023-04-19","P3W4 2023"]
[null,null,null,"2023-04-26","P4W1 2023"]
[null,null,null,"2023-05-03","P4W2 2023"]
[null,null,null,"2023-05-10","P4W3 2023"]
[null,null,null,"2023-05-17","P4W4 2023"]
[null,null,null,"2023-05-24","P5W1 2023"]
[null,null,null,"2023-05-31","P5W2 2023"]
[null,null,null,"2023-06-07","P5W3 2023"]
[null,null,null,"2023-06-14","P5W4 2023"]
{"$rows_left_out":294}
{"sheet":"MEGA Review","index":8,"n_rows":8,"n_cols":19,"rows_kept":8,"cut":false,"hidden":false,"merged":[[0,0,2,2],[3,0,4,3],[5,5,5,6],[5,7,5,8]]}
["  maps"]
[]
[]
["MEGA/Large Scale Review"]
[]
[null,null,null,"UPC Details","Add Group","Save & Submit",null,"Contact Details"]
[null,"con_upc_no","con_des_tx","con_prm_cst","itm_grp_des","evt_per_no","evt_wek_no","evt_yer_no","bil_to_tx","fst_nme_tx","lst_nme_tx","rep_eml_tx","rep_phn_tx","kro_crp_no","rep_tos_flg","grp_div_tx","mga_tag_flg","fyt_pmy_dpt","fyt_com_cd"]
["EDIT","REPEAT","DELETE","Submission #","Item Group Description","Event Period","Event Week","Event Year","Bill To","Contact First Name","Contact Last Name","Contact Email","Phone Number","K#","Agree to Terms","Division Eligibility","Include Tags","Department","Commodity"]

{"sheet":"HDO Review","index":9,"n_rows":8,"n_cols":18,"rows_kept":8,"cut":false,"hidden":false,"merged":[[0,0,2,4],[3,0,4,5]]}
["  maps"]
[]
[]
["Weekly Digital Deals Review"]
[]
[null,null,null,"UPC Details","Contact Details","Add Coupon","Save & Submit"]
[null,"con_upc_no","con_des_tx",null,"evt_wek_tx","net_dwn_rtl","itm_des_tx","itm_siz_rng","cpn_vrb_tx","cpn_fnd_tx","brnd_tx","bil_div_tx","exp_rbp_tx","vnd_cmt_tx","img_one_tx","img_two_tx","cpn_dpt_cd","cpn_com_cd"]
["Edit","Repeat","Delete","Submission #","Event Week","Net Down Retail","Item Description","Size Range","Coupon Verbiage","Funding","Brand","Division Eligiblity","Expand to RBP","Comment","Image 1","Image 2","Department","Commodity"]

{"sheet":"DIGITAL Review","index":10,"n_rows":8,"n_cols":18,"rows_kept":8,"cut":false,"hidden":false,"merged":[[0,0,2,3],[3,0,4,4],[5,6,5,7]]}
["  maps"]
[]
[]
["Digital 5X Event Review"]
[]
[null,null,null,"UPC Details","Contact Details","Add Coupon","Save & Submit"]
[null,"con_upc_no","con_des_tx","con_siz_tx","evt_wek_tx","cpn_val_am","cpn_req_qty","itm_des_tx","itm_siz_rng","cpn_vrb_tx","brnd_tx","bil_div_tx","exp_rbp_tx","vnd_cmt_tx","img_one_tx","img_two_tx","cpn_dpt_cd","cpn_com_cd"]
["Edit","Repeat","Delete","Submission #","Event Week","Coupon Value","Req QTY","Item Description","Size Range","Coupon Verbiage","Brand","Division Eligiblity","Expand to RBP","Comment","Image 1","Image 2","Department","Commodity"]

{"sheet":"Threshold Review","index":11,"n_rows":8,"n_cols":15,"rows_kept":8,"cut":false,"hidden":false,"merged":[[0,0,2,3],[3,0,4,4]]}
["  maps"]
[]
[]
["Small Scale Threshold Event & Must Buys"]
[]
[null,null,null,"UPC Details","Contact Details","Add Offer","Save & Submit"]
[null,"con_upc_no","con_des_tx","con_siz_tx","evt_st_tx","evt_end_tx","ofr_des_tx","ofr_lmt_tx","bil_typ_tx","evt_tag_flg","evt_sgn_flg","bil_div_tx","vnd_cmt_tx","evt_dpt_cd","evt_com_cd"]
["EDIT","REPEATE","DELETE","Submission #","Event Start","Event End","Offer Description","Offer Limit","Billing Type","Tags","Signs","Division Eligiblity","Additional Comments","Department","Commodity"]

{"sheet":"Contact Review","index":12,"n_rows":8,"n_cols":10,"rows_kept":8,"cut":false,"hidden":false,"merged":[[0,0,2,2],[3,0,4,2]]}
["  maps"]
[]
[]
["Contact Review"]
[]
[null,null,"Offer Review","UPC Review"]
[null,"fst_nme_tx","lst_nme_tx","eml_tx","kro_crp_no","cmp_nam_tx","cmp_adr_tx","cmp_loc_tx","cmp_phn_tx","bil_flg"]
["Submission #","First Name","Last Name","Email Address","K#","Company Name","Address","City, State","Phone Number","Billing Contact"]

{"sheet":"UPC Review","index":13,"n_rows":8,"n_cols":9,"rows_kept":8,"cut":false,"hidden":false,"merged":[[0,0,2,3],[3,0,4,3]]}
["  maps"]
[]
[]
["UPC Review"]
[]
[null,"Offer Review","Contact Review"]
[null,"con_upc_no","con_des_tx","con_siz_tx","con_prm_cst","con_prm_rtl","con_dsp_qty","con_shlf_no","lik_con_no"]
["Submission #","Consumer UPC","Basic Item Description","Size"]